{"text_format":"1","workbook":"xlsx","n_sheets":10,"sheets":["Instructions","Budget Period #1","Budget Period #2","Budget Period #3","Budget Period #4","Budget Period #5","Budget Summary","Quick Lookup","SLRs","Rates"],"not_rendered":{"charts":0,"images":0,"macros":1,"external_links":1,"defined_names":17,"comments":0,"pivot_tables":0},"unopened":[],"bounds":{"document_bytes":16777216,"sheet_cells":100000,"rows_first":2000,"rows_last":500,"rows_between":2000,"halvings":0,"cell_chars":16384,"cell_head_chars":4096},"cells_cut":0,"cells_raw":0,"read":"whole","date_system":"1900"}

{"sheet":"Instructions","index":0,"n_rows":78,"n_cols":1,"rows_kept":78,"cut":false,"hidden":false,"merged":[]}
["PAMS - Portfolio Analysis and Management System"]
[]
["Budget Template Instructions"]
["Budgets are required for the entire project period. A budget template should be completed for each budget period of the award, and a cumulative budget form for the entire project period will be populated. A detailed budget justification narrative should be included after the budget pages. The justification should cover labor, domestic and foreign travel, equipment, materials and supplies, and anything else that will be covered with project funds. "]
[]
["·         Budget Period 1 – Budget Period 5 Tabs: Tabs represent budget for each period."]
["·         Budget Summary Tab: Provides a cumulative amount of all budget periods and is populated."]
["COMPLETE FIELDS HIGHLIGHTED IN BLUE"]
[]
["Budget Period Information:"]
["Note: The budget submitted by the primary applicant must include all costs associated with the award."]
[]
["·         Start Date and End Date: Enter the proposed start date and end date of the budget period."]
[]
["A.   Senior/Key Person (Required):"]
{"$rows_left_out":64}
{"sheet":"Budget Period #1","index":1,"n_rows":93,"n_cols":16,"rows_kept":93,"cut":false,"hidden":false,"merged":[[9,9,9,13],[0,1,0,3],[92,1,92,6],[58,1,58,6],[59,1,59,6],[60,1,60,6],[61,1,61,6],[62,1,62,6],[70,1,70,6],[71,1,71,6],[72,1,72,6],[73,1,73,6],[74,1,74,6],[78,1,78,6],[82,1,82,4],[84,1,84,4],[69,9,69,11],[53,1,53,6],[54,1,54,6],[85,1,85,4],[87,1,87,4],[67,1,67,6],[68,1,68,6],[69,1,69,6],[83,1,83,4],[86,1,86,4]]}
[null,"DOE National Laboratory Announcement"]
[null,"Proposal Title",null,null,null,null,null,null,null,null,null,null,null," "]
[null,"Note:  The budget submitted by the primary applicant must include all costs associated with the award. "]
[null,"Budget Period Information"]
[]
[null,"Budget Period Start Date",null,null," (per Program Announcement Guidelines)",null,null,null,null,"Selecting Job Category and Title will populate Band, Rate, and Project Role"]
[null,"Budget Period End Date",null,null," (per Program Announcement Guidelines)",null,null,null,null,"Adding hours will populate Months, Requested Salary, Fringe Benefits, and Funds Requested"]
[null,null,null,null,null,null,null,null,null,"Options: Rate can be selected by band only.  Project role can be customized."]
[null,"A. Senior/Key Person (required):",null,null,null,"Fringe Rate:",{"$f":"Rates!B6","v":0.29749999999999999}]
[null,null,null,null,null,"Fringe PostDoc:",{"$f":"Rates!B7","v":0.23749999999999999},null,null,"Labor Calculations (SLRs)"]
[]
[null,"Name",null,"Project Role","Months","Requested Salary ($)","Fringe Benefits","Funds Requested",null,"Category","Job Title","Band","SLR + VO","Hours",null,"SWF Type (for OH)"]
["1.)",null,null,null,{"$f":"N13/(Rates!$B$22/12)","v":0},{"$f":"ROUND(M13*N13,2)","v":0},{"$f":"ROUND(F13*$G$9,2)","v":0},{"$f":"F13+G13","v":0},null,"Engineers","Senior Engineer",{"$f":"IFERROR(VLOOKUP($K13,'Quick Lookup'!$C$3:$D$40,2,FALSE),\"\")","v":"E5"},{"$f":"SUMIF(SLRs!$B$2:$B$21,'Budget Period #1'!$L13,SLRs!$F$2:$F$21)","v":71.087500000000006},null,null,"Division Staff"]
["2.)",null,null,null,{"$f":"N14/(Rates!$B$22/12)","v":0},{"$f":"ROUND(M14*N14,2)","v":0},0,0,null,null,null,{"$f":"IFERROR(VLOOKUP($K14,'Quick Lookup'!$C$3:$D$40,2,FALSE),\"\")","v":""},{"$f":"SUMIF(SLRs!$B$2:$B$21,'Budget Period #1'!$L14,SLRs!$F$2:$F$21)","v":0},null,null,"Division Staff"]
["3.)",null,null,null,{"$f":"N15/(Rates!$B$22/12)","v":0},0,0,0,null,null,null,{"$f":"IFERROR(VLOOKUP($K15,'Quick Lookup'!$C$3:$D$40,2,FALSE),\"\")","v":""},{"$f":"SUMIF(SLRs!$B$2:$B$21,'Budget Period #1'!$L15,SLRs!$F$2:$F$21)","v":0},null,null,"Division Staff"]
{"$rows_left_out":79}
{"sheet":"Budget Period #2","index":2,"n_rows":93,"n_cols":16,"rows_kept":93,"cut":false,"hidden":false,"merged":[[9,9,9,13],[71,1,71,6],[53,1,53,6],[54,1,54,6],[58,1,58,6],[59,1,59,6],[60,1,60,6],[61,1,61,6],[62,1,62,6],[67,1,67,6],[68,1,68,6],[69,1,69,6],[70,1,70,6],[69,9,69,11],[86,1,86,4],[87,1,87,4],[92,1,92,6],[72,1,72,6],[73,1,73,6],[74,1,74,6],[78,1,78,6],[82,1,82,4],[85,1,85,4],[83,1,83,4],[84,1,84,4]]}
[null,{"$f":"'Budget Period #1'!B1:E1","v":"DOE National Laboratory Announcement"},null,null,{"$f":"IF('Budget Period #1'!E1>0,'Budget Period #1'!E1,\"\")","v":""}]
[null,"Proposal Title",null,{"$f":"IF('Budget Period #1'!D2>0,'Budget Period #1'!D2,\"\")","v":""}]
[null,"Note:  The budget submitted by the primary applicant must include all costs associated with the award. "]
[null,"Budget Period Information"]
[]
[null,"Budget Period Start Date",null,null," (per Program Announcement Guidelines)",null,null,null,null,"Selecting Job Category and Title will populate Band, Rate, and Project Role"]
[null,"Budget Period End Date",null,null," (per Program Announcement Guidelines)",null,null,null,null,"Adding hours will populate Months, Requested Salary, Fringe Benefits, and Funds Requested"]
[null,null,null,null,null,null,null,null,null,"Options: Rate can be selected by band only.  Project role can be customized."]
[null,"A. Senior/Key Person (required):",null,null,null,"Fringe Rate:",{"$f":"Rates!B6","v":0.29749999999999999}]
[null,null,null,null,null,"Fringe PostDoc:",{"$f":"Rates!B7","v":0.23749999999999999},null,null,"Labor Calculations (SLRs)"]
[]
[null,"Name",null,"Project Role","Months","Requested Salary ($)","Fringe Benefits","Funds Requested",null,"Category","Job Title","Band","SLR + VO","Hours",null,"SWF Type (for OH)"]
["1.)",{"$f":"IF('Budget Period #1'!B13>0,'Budget Period #1'!B13,\"\")","v":""},null,{"$f":"IF('Budget Period #1'!D13>0,'Budget Period #1'!D13,\"\")","v":""},{"$f":"N13/(Rates!$B$22/12)","v":0},{"$f":"ROUND(M13*N13,2)","v":0},{"$f":"ROUND(F13*$G$9,2)","v":0},{"$f":"F13+G13","v":0},null,{"$f":"IF('Budget Period #1'!J13>0,'Budget Period #1'!J13,\"\")","v":"Engineers"},{"$f":"IF('Budget Period #1'!K13>0,'Budget Period #1'!K13,\"\")","v":"Senior Engineer"},{"$f":"IFERROR(VLOOKUP($K13,'Quick Lookup'!$C$3:$D$40,2,FALSE),\"\")","v":"E5"},{"$f":"SUMIF(SLRs!$B$2:$B$21,'Budget Period #2'!$L13,SLRs!$F$2:$F$21)*(1+Rates!$B$17)","v":73.362300000000005},null,null,{"$f":"IF('Budget Period #1'!P13>0,'Budget Period #1'!P13,\"\")","v":"Division Staff"}]
["2.)",{"$f":"IF('Budget Period #1'!B14>0,'Budget Period #1'!B14,\"\")","v":""},null,{"$f":"IF('Budget Period #1'!D14>0,'Budget Period #1'!D14,\"\")","v":""},{"$f":"N14/(Rates!$B$22/12)","v":0},0,0,0,null,{"$f":"IF('Budget Period #1'!J14>0,'Budget Period #1'!J14,\"\")","v":""},{"$f":"IF('Budget Period #1'!K14>0,'Budget Period #1'!K14,\"\")","v":""},{"$f":"IFERROR(VLOOKUP($K14,'Quick Lookup'!$C$3:$D$40,2,FALSE),\"\")","v":""},{"$f":"SUMIF(SLRs!$B$2:$B$21,'Budget Period #2'!$L14,SLRs!$F$2:$F$21)*(1+Rates!$B$17)","v":0},null,null,{"$f":"IF('Budget Period #1'!P14>0,'Budget Period #1'!P14,\"\")","v":"Division Staff"}]
["3.)",{"$f":"IF('Budget Period #1'!B15>0,'Budget Period #1'!B15,\"\")","v":""},null,{"$f":"IF('Budget Period #1'!D15>0,'Budget Period #1'!D15,\"\")","v":""},{"$f":"N15/(Rates!$B$22/12)","v":0},0,0,0,null,{"$f":"IF('Budget Period #1'!J15>0,'Budget Period #1'!J15,\"\")","v":""},{"$f":"IF('Budget Period #1'!K15>0,'Budget Period #1'!K15,\"\")","v":""},{"$f":"IFERROR(VLOOKUP($K15,'Quick Lookup'!$C$3:$D$40,2,FALSE),\"\")","v":""},{"$f":"SUMIF(SLRs!$B$2:$B$21,'Budget Period #2'!$L15,SLRs!$F$2:$F$21)*(1+Rates!$B$17)","v":0},null,null,{"$f":"IF('Budget Period #1'!P15>0,'Budget Period #1'!P15,\"\")","v":"Division Staff"}]
{"$rows_left_out":79}
{"sheet":"Budget Period #3","index":3,"n_rows":93,"n_cols":16,"rows_kept":93,"cut":false,"hidden":false,"merged":[[9,9,9,13],[71,1,71,6],[53,1,53,6],[54,1,54,6],[58,1,58,6],[59,1,59,6],[60,1,60,6],[61,1,61,6],[62,1,62,6],[67,1,67,6],[68,1,68,6],[69,1,69,6],[70,1,70,6],[69,9,69,11],[86,1,86,4],[87,1,87,4],[92,1,92,6],[72,1,72,6],[73,1,73,6],[74,1,74,6],[78,1,78,6],[82,1,82,4],[83,1,83,4],[84,1,84,4],[85,1,85,4]]}
[null,{"$f":"'Budget Period #1'!B1:E1","v":"DOE National Laboratory Announcement"},null,null,{"$f":"IF('Budget Period #1'!E1>0,'Budget Period #1'!E1,\"\")","v":""}]
[null,"Proposal Title",null,{"$f":"IF('Budget Period #1'!D2>0,'Budget Period #1'!D2,\"\")","v":""}]
[null,"Note:  The budget submitted by the primary applicant must include all costs associated with the award. "]
[null,"Budget Period Information"]
[]
[null,"Budget Period Start Date",null,null," (per Program Announcement Guidelines)",null,null,null,null,"Selecting Job Category and Title will populate Band, Rate, and Project Role"]
[null,"Budget Period End Date",null,null," (per Program Announcement Guidelines)",null,null,null,null,"Adding hours will populate Months, Requested Salary, Fringe Benefits, and Funds Requested"]
[null,null,null,null,null,null,null,null,null,"Options: Rate can be selected by band only.  Project role can be customized."]
[null,"A. Senior/Key Person (required):",null,null,null,"Fringe Rate:",{"$f":"Rates!B6","v":0.29749999999999999}]
[null,null,null,null,null,"Fringe PostDoc:",{"$f":"Rates!B7","v":0.23749999999999999},null,null,"Labor Calculations (SLRs)"]
[]
[null,"Name",null,"Project Role","Months","Requested Salary ($)","Fringe Benefits","Funds Requested",null,"Category","Job Title","Band","SLR + VO","Hours",null,"SWF Type (for OH)"]
["1.)",{"$f":"IF('Budget Period #1'!B13>0,'Budget Period #1'!B13,\"\")","v":""},null,{"$f":"IF('Budget Period #1'!D13>0,'Budget Period #1'!D13,\"\")","v":""},{"$f":"N13/(Rates!$B$22/12)","v":0},{"$f":"ROUND(M13*N13,2)","v":0},{"$f":"ROUND(F13*$G$9,2)","v":0},{"$f":"F13+G13","v":0},null,{"$f":"IF('Budget Period #1'!J13>0,'Budget Period #1'!J13,\"\")","v":"Engineers"},{"$f":"IF('Budget Period #1'!K13>0,'Budget Period #1'!K13,\"\")","v":"Senior Engineer"},{"$f":"IFERROR(VLOOKUP($K13,'Quick Lookup'!$C$3:$D$40,2,FALSE),\"\")","v":"E5"},{"$f":"SUMIF(SLRs!$B$2:$B$21,'Budget Period #3'!$L13,SLRs!$F$2:$F$21)*(1+Rates!$B$17)*(1+Rates!$B$18)","v":75.709893600000001},null,null,{"$f":"IF('Budget Period #1'!P13>0,'Budget Period #1'!P13,\"\")","v":"Division Staff"}]
["2.)",{"$f":"IF('Budget Period #1'!B14>0,'Budget Period #1'!B14,\"\")","v":""},null,{"$f":"IF('Budget Period #1'!D14>0,'Budget Period #1'!D14,\"\")","v":""},{"$f":"N14/(Rates!$B$22/12)","v":0},0,0,0,null,{"$f":"IF('Budget Period #1'!J14>0,'Budget Period #1'!J14,\"\")","v":""},{"$f":"IF('Budget Period #1'!K14>0,'Budget Period #1'!K14,\"\")","v":""},{"$f":"IFERROR(VLOOKUP($K14,'Quick Lookup'!$C$3:$D$40,2,FALSE),\"\")","v":""},{"$f":"SUMIF(SLRs!$B$2:$B$21,'Budget Period #3'!$L14,SLRs!$F$2:$F$21)*(1+Rates!$B$17)*(1+Rates!$B$18)","v":0},null,null,{"$f":"IF('Budget Period #1'!P14>0,'Budget Period #1'!P14,\"\")","v":"Division Staff"}]
["3.)",{"$f":"IF('Budget Period #1'!B15>0,'Budget Period #1'!B15,\"\")","v":""},null,{"$f":"IF('Budget Period #1'!D15>0,'Budget Period #1'!D15,\"\")","v":""},{"$f":"N15/(Rates!$B$22/12)","v":0},0,0,0,null,{"$f":"IF('Budget Period #1'!J15>0,'Budget Period #1'!J15,\"\")","v":""},{"$f":"IF('Budget Period #1'!K15>0,'Budget Period #1'!K15,\"\")","v":""},{"$f":"IFERROR(VLOOKUP($K15,'Quick Lookup'!$C$3:$D$40,2,FALSE),\"\")","v":""},{"$f":"SUMIF(SLRs!$B$2:$B$21,'Budget Period #3'!$L15,SLRs!$F$2:$F$21)*(1+Rates!$B$17)*(1+Rates!$B$18)","v":0},null,null,{"$f":"IF('Budget Period #1'!P15>0,'Budget Period #1'!P15,\"\")","v":"Division Staff"}]
{"$rows_left_out":79}
{"sheet":"Budget Period #4","index":4,"n_rows":93,"n_cols":16,"rows_kept":93,"cut":false,"hidden":false,"merged":[[9,9,9,13],[71,1,71,6],[53,1,53,6],[54,1,54,6],[58,1,58,6],[59,1,59,6],[60,1,60,6],[61,1,61,6],[62,1,62,6],[67,1,67,6],[68,1,68,6],[69,1,69,6],[70,1,70,6],[69,9,69,11],[86,1,86,4],[87,1,87,4],[92,1,92,6],[72,1,72,6],[73,1,73,6],[74,1,74,6],[78,1,78,6],[82,1,82,4],[83,1,83,4],[84,1,84,4],[85,1,85,4]]}
[null,{"$f":"'Budget Period #1'!B1:E1","v":"DOE National Laboratory Announcement"},null,null,{"$f":"IF('Budget Period #1'!E1>0,'Budget Period #1'!E1,\"\")","v":""}]
[null,"Proposal Title",null,{"$f":"IF('Budget Period #1'!D2>0,'Budget Period #1'!D2,\"\")","v":""}]
[null,"Note:  The budget submitted by the primary applicant must include all costs associated with the award. "]
[null,"Budget Period Information"]
[]
[null,"Budget Period Start Date",null,null," (per Program Announcement Guidelines)",null,null,null,null,"Selecting Job Category and Title will populate Band, Rate, and Project Role"]
[null,"Budget Period End Date",null,null," (per Program Announcement Guidelines)",null,null,null,null,"Adding hours will populate Months, Requested Salary, Fringe Benefits, and Funds Requested"]
[null,null,null,null,null,null,null,null,null,"Options: Rate can be selected by band only.  Project role can be customized."]
[null,"A. Senior/Key Person (required):",null,null,null,"Fringe Rate:",{"$f":"Rates!B6","v":0.29749999999999999}]
[null,null,null,null,null,"Fringe PostDoc:",{"$f":"Rates!B7","v":0.23749999999999999},null,null,"Labor Calculations (SLRs)"]
[]
[null,"Name",null,"Project Role","Months","Requested Salary ($)","Fringe Benefits","Funds Requested",null,"Category","Job Title","Band","SLR + VO","Hours",null,"SWF Type (for OH)"]
["1.)",{"$f":"IF('Budget Period #1'!B13>0,'Budget Period #1'!B13,\"\")","v":""},null,{"$f":"IF('Budget Period #1'!D13>0,'Budget Period #1'!D13,\"\")","v":""},{"$f":"N13/(Rates!$B$22/12)","v":0},{"$f":"ROUND(M13*N13,2)","v":0},{"$f":"ROUND(F13*$G$9,2)","v":0},{"$f":"F13+G13","v":0},null,{"$f":"IF('Budget Period #1'!J13>0,'Budget Period #1'!J13,\"\")","v":"Engineers"},{"$f":"IF('Budget Period #1'!K13>0,'Budget Period #1'!K13,\"\")","v":"Senior Engineer"},{"$f":"IFERROR(VLOOKUP($K13,'Quick Lookup'!$C$3:$D$40,2,FALSE),\"\")","v":"E5"},{"$f":"SUMIF(SLRs!$B$2:$B$21,'Budget Period #4'!$L13,SLRs!$F$2:$F$21)*(1+Rates!$B$17)*(1+Rates!$B$18)*(1+Rates!$B$19)","v":78.056900301599995},null,null,{"$f":"IF('Budget Period #1'!P13>0,'Budget Period #1'!P13,\"\")","v":"Division Staff"}]
["2.)",{"$f":"IF('Budget Period #1'!B14>0,'Budget Period #1'!B14,\"\")","v":""},null,{"$f":"IF('Budget Period #1'!D14>0,'Budget Period #1'!D14,\"\")","v":""},{"$f":"N14/(Rates!$B$22/12)","v":0},0,0,0,null,{"$f":"IF('Budget Period #1'!J14>0,'Budget Period #1'!J14,\"\")","v":""},{"$f":"IF('Budget Period #1'!K14>0,'Budget Period #1'!K14,\"\")","v":""},{"$f":"IFERROR(VLOOKUP($K14,'Quick Lookup'!$C$3:$D$40,2,FALSE),\"\")","v":""},{"$f":"SUMIF(SLRs!$B$2:$B$21,'Budget Period #4'!$L14,SLRs!$F$2:$F$21)*(1+Rates!$B$17)*(1+Rates!$B$18)*(1+Rates!$B$19)","v":0},null,null,{"$f":"IF('Budget Period #1'!P14>0,'Budget Period #1'!P14,\"\")","v":"Division Staff"}]
["3.)",{"$f":"IF('Budget Period #1'!B15>0,'Budget Period #1'!B15,\"\")","v":""},null,{"$f":"IF('Budget Period #1'!D15>0,'Budget Period #1'!D15,\"\")","v":""},{"$f":"N15/(Rates!$B$22/12)","v":0},0,0,0,null,{"$f":"IF('Budget Period #1'!J15>0,'Budget Period #1'!J15,\"\")","v":""},{"$f":"IF('Budget Period #1'!K15>0,'Budget Period #1'!K15,\"\")","v":""},{"$f":"IFERROR(VLOOKUP($K15,'Quick Lookup'!$C$3:$D$40,2,FALSE),\"\")","v":""},{"$f":"SUMIF(SLRs!$B$2:$B$21,'Budget Period #4'!$L15,SLRs!$F$2:$F$21)*(1+Rates!$B$17)*(1+Rates!$B$18)*(1+Rates!$B$19)","v":0},null,null,{"$f":"IF('Budget Period #1'!P15>0,'Budget Period #1'!P15,\"\")","v":"Division Staff"}]
{"$rows_left_out":79}
{"sheet":"Budget Period #5","index":5,"n_rows":93,"n_cols":16,"rows_kept":93,"cut":false,"hidden":false,"merged":[[9,9,9,13],[71,1,71,6],[53,1,53,6],[54,1,54,6],[58,1,58,6],[59,1,59,6],[60,1,60,6],[61,1,61,6],[62,1,62,6],[67,1,67,6],[68,1,68,6],[69,1,69,6],[70,1,70,6],[69,9,69,11],[86,1,86,4],[87,1,87,4],[92,1,92,6],[72,1,72,6],[73,1,73,6],[74,1,74,6],[78,1,78,6],[82,1,82,4],[83,1,83,4],[84,1,84,4],[85,1,85,4]]}
[null,{"$f":"'Budget Period #1'!B1:E1","v":"DOE National Laboratory Announcement"},null,null,{"$f":"IF('Budget Period #1'!E1>0,'Budget Period #1'!E1,\"\")","v":""}]
[null,"Proposal Title",null,{"$f":"IF('Budget Period #1'!D2>0,'Budget Period #1'!D2,\"\")","v":""}]
[null,"Note:  The budget submitted by the primary applicant must include all costs associated with the award. "]
[null,"Budget Period Information"]
[]
[null,"Budget Period Start Date",null,null," (per Program Announcement Guidelines)",null,null,null,null,"Selecting Job Category and Title will populate Band, Rate, and Project Role"]
[null,"Budget Period End Date",null,null," (per Program Announcement Guidelines)",null,null,null,null,"Adding hours will populate Months, Requested Salary, Fringe Benefits, and Funds Requested"]
[null,null,null,null,null,null,null,null,null,"Options: Rate can be selected by band only.  Project role can be customized."]
[null,"A. Senior/Key Person (required):",null,null,null,"Fringe Rate:",{"$f":"Rates!B6","v":0.29749999999999999}]
[null,null,null,null,null,"Fringe PostDoc:",{"$f":"Rates!B7","v":0.23749999999999999},null,null,"Labor Calculations (SLRs)"]
[]
[null,"Name",null,"Project Role","Months","Requested Salary ($)","Fringe Benefits","Funds Requested",null,"Category","Job Title","Band","SLR + VO","Hours",null,"SWF Type (for OH)"]
["1.)",{"$f":"IF('Budget Period #1'!B13>0,'Budget Period #1'!B13,\"\")","v":""},null,{"$f":"IF('Budget Period #1'!D13>0,'Budget Period #1'!D13,\"\")","v":""},{"$f":"N13/(Rates!$B$22/12)","v":0},{"$f":"ROUND(M13*N13,2)","v":0},{"$f":"ROUND(F13*$G$9,2)","v":0},{"$f":"F13+G13","v":0},null,{"$f":"IF('Budget Period #1'!J13>0,'Budget Period #1'!J13,\"\")","v":"Engineers"},{"$f":"IF('Budget Period #1'!K13>0,'Budget Period #1'!K13,\"\")","v":"Senior Engineer"},{"$f":"IFERROR(VLOOKUP($K13,'Quick Lookup'!$C$3:$D$40,2,FALSE),\"\")","v":"E5"},{"$f":"SUMIF(SLRs!$B$2:$B$21,'Budget Period #5'!$L13,SLRs!$F$2:$F$21)*(1+Rates!$B$17)*(1+Rates!$B$18)*(1+Rates!$B$19)*(1+Rates!$B$20)","v":80.476664210949593},null,null,{"$f":"IF('Budget Period #1'!P13>0,'Budget Period #1'!P13,\"\")","v":"Division Staff"}]
["2.)",{"$f":"IF('Budget Period #1'!B14>0,'Budget Period #1'!B14,\"\")","v":""},null,{"$f":"IF('Budget Period #1'!D14>0,'Budget Period #1'!D14,\"\")","v":""},{"$f":"N14/(Rates!$B$22/12)","v":0},0,0,0,null,{"$f":"IF('Budget Period #1'!J14>0,'Budget Period #1'!J14,\"\")","v":""},{"$f":"IF('Budget Period #1'!K14>0,'Budget Period #1'!K14,\"\")","v":""},{"$f":"IFERROR(VLOOKUP($K14,'Quick Lookup'!$C$3:$D$40,2,FALSE),\"\")","v":""},{"$f":"SUMIF(SLRs!$B$2:$B$21,'Budget Period #5'!$L14,SLRs!$F$2:$F$21)*(1+Rates!$B$17)*(1+Rates!$B$18)*(1+Rates!$B$19)*(1+Rates!$B$20)","v":0},null,null,{"$f":"IF('Budget Period #1'!P14>0,'Budget Period #1'!P14,\"\")","v":"Division Staff"}]
["3.)",{"$f":"IF('Budget Period #1'!B15>0,'Budget Period #1'!B15,\"\")","v":""},null,{"$f":"IF('Budget Period #1'!D15>0,'Budget Period #1'!D15,\"\")","v":""},{"$f":"N15/(Rates!$B$22/12)","v":0},0,0,0,null,{"$f":"IF('Budget Period #1'!J15>0,'Budget Period #1'!J15,\"\")","v":""},{"$f":"IF('Budget Period #1'!K15>0,'Budget Period #1'!K15,\"\")","v":""},{"$f":"IFERROR(VLOOKUP($K15,'Quick Lookup'!$C$3:$D$40,2,FALSE),\"\")","v":""},{"$f":"SUMIF(SLRs!$B$2:$B$21,'Budget Period #5'!$L15,SLRs!$F$2:$F$21)*(1+Rates!$B$17)*(1+Rates!$B$18)*(1+Rates!$B$19)*(1+Rates!$B$20)","v":0},null,null,{"$f":"IF('Budget Period #1'!P15>0,'Budget Period #1'!P15,\"\")","v":"Division Staff"}]
{"$rows_left_out":79}
{"sheet":"Budget Summary","index":6,"n_rows":93,"n_cols":12,"rows_kept":93,"cut":false,"hidden":false,"merged":[[61,1,61,6],[62,1,62,6],[67,1,67,6],[68,1,68,6],[69,1,69,6],[53,1,53,6],[54,1,54,6],[58,1,58,6],[59,1,59,6],[60,1,60,6],[69,9,69,11],[86,1,86,4],[87,1,87,4],[92,1,92,6],[72,1,72,6],[73,1,73,6],[74,1,74,6],[78,1,78,6],[82,1,82,4],[85,1,85,4],[83,1,83,4],[84,1,84,4],[71,1,71,6],[70,1,70,6]]}
[null,{"$f":"'Budget Period #1'!B1:E1","v":"DOE National Laboratory Announcement"},null,null,{"$f":"IF('Budget Period #1'!E1>0,'Budget Period #1'!E1,\"\")","v":""}]
[null,"Proposal Title",null,{"$f":"IF('Budget Period #1'!D2>0,'Budget Period #1'!D2,\"\")","v":""}]
[null,"Note:  The budget submitted by the primary applicant must include all costs associated with the award. "]
[null,"Budget Period Information"]
[]
[null,"Budget Period Start Date",null,null," (per Program Announcement Guidelines)"]
[null,"Budget Period End Date",null,null," (per Program Announcement Guidelines)"]
[]
[null,"A. Senior/Key Person (required):",null,null,null,"Fringe Rate:",{"$f":"Rates!B6","v":0.29749999999999999}]
[null,null,null,null,null,"Fringe PostDoc:",{"$f":"Rates!B7","v":0.23749999999999999}]
[]
[null,"Name",null,"Project Role","Months","Requested Salary ($)","Fringe Benefits","Funds Requested"]
["1.)",{"$f":"IF('Budget Period #1'!B13>0,'Budget Period #1'!B13,\"\")","v":""},null,{"$f":"IF('Budget Period #1'!D13>0,'Budget Period #1'!D13,\"\")","v":""},{"$f":"'Budget Period #1'!E13+'Budget Period #2'!E13+'Budget Period #3'!E13+'Budget Period #4'!E13+'Budget Period #5'!E13","v":0},{"$f":"'Budget Period #1'!F13+'Budget Period #2'!F13+'Budget Period #3'!F13+'Budget Period #4'!F13+'Budget Period #5'!F13","v":0},{"$f":"'Budget Period #1'!G13+'Budget Period #2'!G13+'Budget Period #3'!G13+'Budget Period #4'!G13+'Budget Period #5'!G13","v":0},{"$f":"F13+G13","v":0}]
["2.)",{"$f":"IF('Budget Period #1'!B14>0,'Budget Period #1'!B14,\"\")","v":""},null,{"$f":"IF('Budget Period #1'!D14>0,'Budget Period #1'!D14,\"\")","v":""},{"$f":"'Budget Period #1'!E14+'Budget Period #2'!E14+'Budget Period #3'!E14+'Budget Period #4'!E14+'Budget Period #5'!E14","v":0},{"$f":"'Budget Period #1'!F14+'Budget Period #2'!F14+'Budget Period #3'!F14+'Budget Period #4'!F14+'Budget Period #5'!F14","v":0},{"$f":"'Budget Period #1'!G14+'Budget Period #2'!G14+'Budget Period #3'!G14+'Budget Period #4'!G14+'Budget Period #5'!G14","v":0},0]
["3.)",{"$f":"IF('Budget Period #1'!B15>0,'Budget Period #1'!B15,\"\")","v":""},null,{"$f":"IF('Budget Period #1'!D15>0,'Budget Period #1'!D15,\"\")","v":""},{"$f":"'Budget Period #1'!E15+'Budget Period #2'!E15+'Budget Period #3'!E15+'Budget Period #4'!E15+'Budget Period #5'!E15","v":0},{"$f":"'Budget Period #1'!F15+'Budget Period #2'!F15+'Budget Period #3'!F15+'Budget Period #4'!F15+'Budget Period #5'!F15","v":0},{"$f":"'Budget Period #1'!G15+'Budget Period #2'!G15+'Budget Period #3'!G15+'Budget Period #4'!G15+'Budget Period #5'!G15","v":0},0]
{"$rows_left_out":79}
{"sheet":"Quick Lookup","index":7,"n_rows":42,"n_cols":8,"rows_kept":42,"cut":false,"hidden":true,"merged":[[2,1,7,1],[8,1,15,1],[16,1,20,1],[21,1,30,1],[31,1,36,1]]}
[]
[null,"FY16 Preliminary v2","Job Title","Band"]
[null,"Designers & Drafters","Drafter","N2",null,"Designers_Drafters",null,"Division Staff"]
[null,null,"Drafter Sr","N3",null,"Engineers",null,"Section Staff"]
[null,null,"Designer","N4",null,"Engineering_Physicists"]
[null,null,"Designer Sr","N4",null,"Scientists"]
[null,null,"Design Drafter","N3",null,"Technical"]
[null,null,"Design Drafter Sr","N4"]
[null,"Engineers","Engineering Associate","N4"]
[null,null,"Engineering Associate Sr","E4"]
[null,null,"Engineer","E2"]
[null,null,"Staff Engineer","E4"]
[null,null,"Senior Engineer","E5"]
[null,null,"Principal Engineer","E6"]
[null,null,"Senior Principal Engineer","E7"]
{"$rows_left_out":28}
{"sheet":"SLRs","index":8,"n_rows":21,"n_cols":6,"rows_kept":21,"cut":false,"hidden":true,"merged":[[17,0,20,0],[1,0,8,0],[9,0,12,0],[13,0,16,0]]}
["FY16 PROVISIONAL","Band","SLRate",null,"VO","SLR+VO"]
["Exempt","E1",30.75,null,{"$f":"C2*(Rates!$B$2+Rates!$B$4)","v":5.3812499999999996},{"$f":"E2+C2","v":36.131250000000001}]
[null,"E2",36.5,null,{"$f":"C3*(Rates!$B$2+Rates!$B$4)","v":6.3874999999999993},{"$f":"E3+C3","v":42.887500000000003}]
[null,"E3",44.5,null,{"$f":"C4*(Rates!$B$2+Rates!$B$4)","v":7.7874999999999996},52.287500000000001]
[null,"E4",51.25,null,{"$f":"C5*(Rates!$B$2+Rates!$B$4)","v":8.96875},60.21875]
[null,"E5",60.5,null,{"$f":"C6*(Rates!$B$2+Rates!$B$4)","v":10.587499999999999},71.087500000000006]
[null,"E6",69.5,null,{"$f":"C7*(Rates!$B$2+Rates!$B$4)","v":12.1625},81.662499999999994]
[null,"E7",87.25,null,{"$f":"C8*(Rates!$B$2+Rates!$B$4)","v":15.268749999999999},102.51875]
[null,"E8",114.75,null,{"$f":"C9*(Rates!$B$2+Rates!$B$4)","v":20.081249999999997},134.83125000000001]
["Non-Exempt","N1",15.75,null,{"$f":"C10*(Rates!$B$3+Rates!$B$5)","v":3.2287500000000002},18.978750000000002]
[null,"N2",22.75,null,{"$f":"C11*(Rates!$B$3+Rates!$B$5)","v":4.6637500000000003},{"$f":"E11+C11","v":27.41375}]
[null,"N3",29.75,null,{"$f":"C12*(Rates!$B$3+Rates!$B$5)","v":6.0987500000000008},35.848750000000003]
[null,"N4",40,null,{"$f":"C13*(Rates!$B$3+Rates!$B$5)","v":8.2000000000000011},48.2]
["Union","UDR",23.75,null,null,{"$f":"C14","v":23.75}]
[null,"UFF",24.5,null,null,{"$f":"C15","v":24.5}]
{"$rows_left_out":7}
{"sheet":"Rates","index":9,"n_rows":22,"n_cols":3,"rows_kept":22,"cut":false,"hidden":true,"merged":[]}
["Rates Type","Rate"]
["Vacation - Monthly",0.1]
["Vacation - Weekly",0.11]
["OPTO - Monthly",7.4999999999999997E-2]
["OPTO - Weekly",9.5000000000000001E-2]
["Fringe",0.29749999999999999]
["Fringe - Post Doc",0.23749999999999999]
[]
["PS",0.93530000000000002,"Effective - Divisional"]
["MSA",0.2631,"Effective"]
["CSS",0.69469999999999998,"Effective - Non-Divisional"]
["G&A",0.18720000000000001,"Effective"]
["LDRD",1.2500000000000001E-2]
["Pass-Through - Labs",0.03]
["Pass-Through",4.2900000000000001E-2,"Effective"]
{"$rows_left_out":7}