{"text_format":"1","workbook":"xlsx","n_sheets":7,"sheets":["Assessment","Examples","Probability","Hazard Severity Matrix","Risk Assessment Actions","Hazard Control Hierarchy","Look-up Tables"],"not_rendered":{"charts":0,"images":1,"macros":1,"external_links":0,"defined_names":0,"comments":0,"pivot_tables":0},"unopened":[],"bounds":{"document_bytes":16777216,"sheet_cells":100000,"rows_first":2000,"rows_last":500,"rows_between":2000,"halvings":0,"cell_chars":16384,"cell_head_chars":4096},"cells_cut":0,"cells_raw":0,"read":"whole","date_system":"1900"}

{"sheet":"Assessment","index":0,"n_rows":204,"n_cols":18,"rows_kept":204,"cut":false,"hidden":false,"merged":[[5,1,5,6],[5,7,5,9],[5,11,5,13],[5,14,5,17],[0,0,0,17],[2,2,2,3],[2,5,2,7],[2,8,2,9],[3,2,3,3],[3,5,3,7],[3,8,3,9]]}
["Prevention through Design (PtD) Hazard Risk Assessment"]
[]
[null,"Date:",null,null,"Project:",null,null,null,"Review Phase"]
[null,"Author:",null,null,"Sub-project:",null,null,null,"Doc # and Rev #"]
[]
[null,"Potential Hazard, Threat, or Unwanted Consequence",null,null,null,null,null,"Inherent Risk",null,null,"Mitigation","Residual Risk",null,null,"Risk Mitigation Status & Details"]
["#","Description","Owner(s)","Subsys","Life Cycle","Risk to who?","Risk to what?","Severity","Prob.","Impact","General Description","Severity2","Prob.2","Impact2","Action","Effectiv","Status","Comments"]
[1,"Rigging BTL magnets both in the gallery and in the tunnel","MagPS","BTL-Magnets","Installation","Installation personel"," magnets","Medium","Possible",{"$f":"IFERROR(INDEX( 'Look-up Tables'!$I$3:$M$7, MATCH(H8,'Look-up Tables'!$H$3:$H$7,0), MATCH(I8,'Look-up Tables'!$I$2:$M$2,0)), \" \")","v":"Moderate"},"During design stage, specifications will be included in the design for proper rigging points.Specifications will be made in cojunction with Mech Engineer and Installation manager","Minimal","Unlikely",{"$f":"IFERROR(INDEX( 'Look-up Tables'!$I$3:$M$7, MATCH(L8,'Look-up Tables'!$H$3:$H$7,0), MATCH(M8,'Look-up Tables'!$I$2:$M$2,0)), \" \")","v":"Negligible"},"Int. into Design","Eliminate","Not Yet Implemented","The specifications for rigging fixtures will be part of the specifications for the various BTL Magnets"]
[null,null,null,null,null,null,null,null,null,{"$f":"IFERROR(INDEX( 'Look-up Tables'!$I$3:$M$7, MATCH(H9,'Look-up Tables'!$H$3:$H$7,0), MATCH(I9,'Look-up Tables'!$I$2:$M$2,0)), \" \")","v":" "},null,null,null,{"$f":"IFERROR(INDEX( 'Look-up Tables'!$I$3:$M$7, MATCH(L9,'Look-up Tables'!$H$3:$H$7,0), MATCH(M9,'Look-up Tables'!$I$2:$M$2,0)), \" \")","v":" "}]
[{"$f":"A8+1","v":2},"Magnets must be able to be stabely mounted on stands","MagPS","BTL-Magnets","Installation","Installation personnel and personnel on access","magnets","Low","Possible",{"$f":"IFERROR(INDEX( 'Look-up Tables'!$I$3:$M$7, MATCH(H10,'Look-up Tables'!$H$3:$H$7,0), MATCH(I10,'Look-up Tables'!$I$2:$M$2,0)), \" \")","v":"Moderate"},"During design stage, specifications will be included in the design for proper mounting fixtures that will be part of the magnet.Specifications will be made in cojunction with Mech Engineer and Installation manager","Minimal","Rare",{"$f":"IFERROR(INDEX( 'Look-up Tables'!$I$3:$M$7, MATCH(L10,'Look-up Tables'!$H$3:$H$7,0), MATCH(M10,'Look-up Tables'!$I$2:$M$2,0)), \" \")","v":"Negligible"},"Int. into Design","Eliminate","Not Yet Implemented","The specifications for mounting fixtures will be part of the specifications for the various BTL Magnets. The magnet must be constrained in all dimensions"]
[null,null,null,null,null,null,null,null,null,{"$f":"IFERROR(INDEX( 'Look-up Tables'!$I$3:$M$7, MATCH(H11,'Look-up Tables'!$H$3:$H$7,0), MATCH(I11,'Look-up Tables'!$I$2:$M$2,0)), \" \")","v":" "},null,null,null,{"$f":"IFERROR(INDEX( 'Look-up Tables'!$I$3:$M$7, MATCH(L11,'Look-up Tables'!$H$3:$H$7,0), MATCH(M11,'Look-up Tables'!$I$2:$M$2,0)), \" \")","v":" "}]
[{"$f":"A10+1","v":3},"Cabling from power supplies to magnets or magnet to magnet not sufficient to carry the current","MagPS","BTL-Power Supplies","Installation, Operations",null,"Halted operation due to open cables. Possible fire hazard","Minimal","Unlikely",{"$f":"IFERROR(INDEX( 'Look-up Tables'!$I$3:$M$7, MATCH(H12,'Look-up Tables'!$H$3:$H$7,0), MATCH(I12,'Look-up Tables'!$I$2:$M$2,0)), \" \")","v":"Negligible"},"All cables will be in accordance with NEC regulations. All cabling will be appropriatly derated and sized in conjunction with EE-Support Engineers","Minimal","Rare",{"$f":"IFERROR(INDEX( 'Look-up Tables'!$I$3:$M$7, MATCH(L12,'Look-up Tables'!$H$3:$H$7,0), MATCH(M12,'Look-up Tables'!$I$2:$M$2,0)), \" \")","v":"Negligible"},"Int. into Design","Eliminate","In Process"]
[null,null,null,null,null,null,null,null,null,{"$f":"IFERROR(INDEX( 'Look-up Tables'!$I$3:$M$7, MATCH(H13,'Look-up Tables'!$H$3:$H$7,0), MATCH(I13,'Look-up Tables'!$I$2:$M$2,0)), \" \")","v":" "},null,null,null,{"$f":"IFERROR(INDEX( 'Look-up Tables'!$I$3:$M$7, MATCH(L13,'Look-up Tables'!$H$3:$H$7,0), MATCH(M13,'Look-up Tables'!$I$2:$M$2,0)), \" \")","v":" "}]
[{"$f":"A12+1","v":4},"Shock hazard due to ungrounded metal components","MagPS","BTL-Magnets, BTL-Power Supplies","Operations","personnel in gallery and personnel on access",null,"Minimal","Unlikely",{"$f":"IFERROR(INDEX( 'Look-up Tables'!$I$3:$M$7, MATCH(H14,'Look-up Tables'!$H$3:$H$7,0), MATCH(I14,'Look-up Tables'!$I$2:$M$2,0)), \" \")","v":"Negligible"},"All relay racks and magnets will be grounded using heavy gauge wire and welded or bolted connections. Relay racks will be grounded to building ground","Minimal","Rare",{"$f":"IFERROR(INDEX( 'Look-up Tables'!$I$3:$M$7, MATCH(L14,'Look-up Tables'!$H$3:$H$7,0), MATCH(M14,'Look-up Tables'!$I$2:$M$2,0)), \" \")","v":"Negligible"},"Int. into QA Plan","Eliminate","In Process"]
[null,null,null,null,null,null,null,null,null,{"$f":"IFERROR(INDEX( 'Look-up Tables'!$I$3:$M$7, MATCH(H15,'Look-up Tables'!$H$3:$H$7,0), MATCH(I15,'Look-up Tables'!$I$2:$M$2,0)), \" \")","v":" "},null,null,null,{"$f":"IFERROR(INDEX( 'Look-up Tables'!$I$3:$M$7, MATCH(L15,'Look-up Tables'!$H$3:$H$7,0), MATCH(M15,'Look-up Tables'!$I$2:$M$2,0)), \" \")","v":" "}]
[{"$f":"A14+1","v":5},"Shock hazard due to exposed conductors","MagPS","BTL-Magnets, BTL-Power Supplies","Operations, Maintenance, Troubleshooting","personnel in gallery and personnel on access",null,"Low","Unlikely",{"$f":"IFERROR(INDEX( 'Look-up Tables'!$I$3:$M$7, MATCH(H16,'Look-up Tables'!$H$3:$H$7,0), MATCH(I16,'Look-up Tables'!$I$2:$M$2,0)), \" \")","v":"Minor"},"All current carrying conductors will be covered to prevent inadvertent contact","Minimal","Unlikely",{"$f":"IFERROR(INDEX( 'Look-up Tables'!$I$3:$M$7, MATCH(L16,'Look-up Tables'!$H$3:$H$7,0), MATCH(M16,'Look-up Tables'!$I$2:$M$2,0)), \" \")","v":"Negligible"},"Int. into QA Plan","Eliminate","In Process"]
[null,null,null,null,null,null,null,null,null,{"$f":"IFERROR(INDEX( 'Look-up Tables'!$I$3:$M$7, MATCH(H17,'Look-up Tables'!$H$3:$H$7,0), MATCH(I17,'Look-up Tables'!$I$2:$M$2,0)), \" \")","v":" "},null,null,null,{"$f":"IFERROR(INDEX( 'Look-up Tables'!$I$3:$M$7, MATCH(L17,'Look-up Tables'!$H$3:$H$7,0), MATCH(M17,'Look-up Tables'!$I$2:$M$2,0)), \" \")","v":" "}]
[{"$f":"A16+1","v":6},"Fire hazard due to excessive AC current to power supply systems","MagPS","BTL-Power Supplies","Testing, Operations",null,"Power supply assemblies","Low","Unlikely",{"$f":"IFERROR(INDEX( 'Look-up Tables'!$I$3:$M$7, MATCH(H18,'Look-up Tables'!$H$3:$H$7,0), MATCH(I18,'Look-up Tables'!$I$2:$M$2,0)), \" \")","v":"Minor"},"Size breakers to prevent excessively high currents","Minimal","Rare",{"$f":"IFERROR(INDEX( 'Look-up Tables'!$I$3:$M$7, MATCH(L18,'Look-up Tables'!$H$3:$H$7,0), MATCH(M18,'Look-up Tables'!$I$2:$M$2,0)), \" \")","v":"Negligible"},"Int. into Design","Eliminate","In Process","Smoke detectors will be installed in relay racks with power supply assemblies which will inhibit input power"]
[null,null,null,null,null,null,null,null,null,{"$f":"IFERROR(INDEX( 'Look-up Tables'!$I$3:$M$7, MATCH(H19,'Look-up Tables'!$H$3:$H$7,0), MATCH(I19,'Look-up Tables'!$I$2:$M$2,0)), \" \")","v":" "},null,null,null,{"$f":"IFERROR(INDEX( 'Look-up Tables'!$I$3:$M$7, MATCH(L19,'Look-up Tables'!$H$3:$H$7,0), MATCH(M19,'Look-up Tables'!$I$2:$M$2,0)), \" \")","v":" "}]
[{"$f":"A18+1","v":7},"Excessive current in cables and equipment due to a ground fault which could result in damage to the power supply system","MagPS","BTL-Power Supplies","Operations",null,"Power supplies and cabling","Low","Unlikely",{"$f":"IFERROR(INDEX( 'Look-up Tables'!$I$3:$M$7, MATCH(H20,'Look-up Tables'!$H$3:$H$7,0), MATCH(I20,'Look-up Tables'!$I$2:$M$2,0)), \" \")","v":"Minor"},"Ground fault detector circuits will be installed with each power supply to inhibit the power supplies in case of a ground fault","Minimal","Rare",{"$f":"IFERROR(INDEX( 'Look-up Tables'!$I$3:$M$7, MATCH(L20,'Look-up Tables'!$H$3:$H$7,0), MATCH(M20,'Look-up Tables'!$I$2:$M$2,0)), \" \")","v":"Negligible"},"Int. into Design","Engr. Controls","In Process"]
{"$rows_left_out":185}
{"sheet":"Examples","index":1,"n_rows":204,"n_cols":18,"rows_kept":204,"cut":false,"hidden":false,"merged":[[0,0,0,17],[2,5,2,7],[3,5,3,7],[5,1,5,6],[5,7,5,9],[5,11,5,13],[5,14,5,17],[3,8,3,9],[2,8,2,9],[3,2,3,3],[2,2,2,3]]}
["Prevention through Design (PtD) Hazard Risk Assessment"]
[]
[null,"Date:","Nov. 18, 2019",null,"Project:","New Accelerator",null,null,"Review Phase",null,"Requirements & Specifications"]
[null,"Author:","Lea D. Engineer",null,"Sub-project:","New Accelerator Sub-project",null,null,"Doc # and Rev #",null,"ED000000 Rev -"]
[]
[null,"Potential Hazard, Threat, or Unwanted Consequence",null,null,null,null,null,"Inherent Risk",null,null,"Mitigation","Residual Risk",null,null,"Risk Mitigation Status & Details"]
["#","Description","Owner(s)","Subsys","Life Cycle","Risk to who?","Risk to what?","Severity","Prob.","Impact","General Description","Severity2","Prob.2","Impact2","Action","Effectiv","Status","Comments"]
[1,"Overexposure to radiation from machine operations","Connie Controls",null,"Operations","Personnel on access in beamline enclosure","-","Critical","Almost Certain",{"$f":"IFERROR(INDEX( 'Look-up Tables'!$I$3:$M$7, MATCH(H8,'Look-up Tables'!$H$3:$H$7,0), MATCH(I8,'Look-up Tables'!$I$2:$M$2,0)), \" \")","v":"Critical"},"Global requirement to supply a radiation safety interlock system.  Technical specification for system to be compliant with FRCM Chapter 10.","Critical","Rare",{"$f":"IFERROR(INDEX( 'Look-up Tables'!$I$3:$M$7, MATCH(L8,'Look-up Tables'!$H$3:$H$7,0), MATCH(M8,'Look-up Tables'!$I$2:$M$2,0)), \" \")","v":"Moderate"},"Integrate into Design","Engr. Controls","In Process","Generic  Example"]
[null,null,null,null,null,null,null,null,null,{"$f":"IFERROR(INDEX( 'Look-up Tables'!$I$3:$M$7, MATCH(H9,'Look-up Tables'!$H$3:$H$7,0), MATCH(I9,'Look-up Tables'!$I$2:$M$2,0)), \" \")","v":" "},null,null,null,{"$f":"IFERROR(INDEX( 'Look-up Tables'!$I$3:$M$7, MATCH(L9,'Look-up Tables'!$H$3:$H$7,0), MATCH(M9,'Look-up Tables'!$I$2:$M$2,0)), \" \")","v":" "}]
[{"$f":"A8+1","v":2},"Injury or fatality due to catastrophic  failure of a cryomodule","Mikayla Mechanical",null,"Operations","Personnel on access in beamline enclosure","-","Critical","Possible",{"$f":"IFERROR(INDEX( 'Look-up Tables'!$I$3:$M$7, MATCH(H10,'Look-up Tables'!$H$3:$H$7,0), MATCH(I10,'Look-up Tables'!$I$2:$M$2,0)), \" \")","v":"Critical"},"General Functional Requirement to abide by all FESHM and FRCM requirements.  Specific pressure and cryogenic safety chapters from the FESHM are referenced in the functional requirements specification","Critical","Rare",{"$f":"IFERROR(INDEX( 'Look-up Tables'!$I$3:$M$7, MATCH(L10,'Look-up Tables'!$H$3:$H$7,0), MATCH(M10,'Look-up Tables'!$I$2:$M$2,0)), \" \")","v":"Moderate"},"Integrate into QA Plan","Admin. Controls","Implemented","Generic  Example"]
[null,null,null,null,null,null,null,null,null,{"$f":"IFERROR(INDEX( 'Look-up Tables'!$I$3:$M$7, MATCH(H11,'Look-up Tables'!$H$3:$H$7,0), MATCH(I11,'Look-up Tables'!$I$2:$M$2,0)), \" \")","v":" "},null,null,null,{"$f":"IFERROR(INDEX( 'Look-up Tables'!$I$3:$M$7, MATCH(L11,'Look-up Tables'!$H$3:$H$7,0), MATCH(M11,'Look-up Tables'!$I$2:$M$2,0)), \" \")","v":" "}]
[{"$f":"A10+1","v":3},"Insufficient space for radiological frisking equipment limits emergency egress path","Cybil Civil",null,"Operations","Personnel on access in beamline enclosure","-","High","Possible",{"$f":"IFERROR(INDEX( 'Look-up Tables'!$I$3:$M$7, MATCH(H12,'Look-up Tables'!$H$3:$H$7,0), MATCH(I12,'Look-up Tables'!$I$2:$M$2,0)), \" \")","v":"Serious"},"Conventional Facilities Technical Specification updated to define necessary space for enclosure frisking equipment","High","Rare",{"$f":"IFERROR(INDEX( 'Look-up Tables'!$I$3:$M$7, MATCH(L12,'Look-up Tables'!$H$3:$H$7,0), MATCH(M12,'Look-up Tables'!$I$2:$M$2,0)), \" \")","v":"Minor"},"Int. into Specs and Interfaces","Eliminate","In Process","Generic  Example"]
[null,null,null,null,null,null,null,null,null,{"$f":"IFERROR(INDEX( 'Look-up Tables'!$I$3:$M$7, MATCH(H13,'Look-up Tables'!$H$3:$H$7,0), MATCH(I13,'Look-up Tables'!$I$2:$M$2,0)), \" \")","v":" "},null,null,null,{"$f":"IFERROR(INDEX( 'Look-up Tables'!$I$3:$M$7, MATCH(L13,'Look-up Tables'!$H$3:$H$7,0), MATCH(M13,'Look-up Tables'!$I$2:$M$2,0)), \" \")","v":" "}]
[{"$f":"A12+1","v":4},"Strain injury during LCW pump installation / replacement ","Stella Structural",null,"Installation, Maintenance, Repairs/Replacement, Decommissioning","Contractors and Maintenance personnel","-","High","Likely",{"$f":"IFERROR(INDEX( 'Look-up Tables'!$I$3:$M$7, MATCH(H14,'Look-up Tables'!$H$3:$H$7,0), MATCH(I14,'Look-up Tables'!$I$2:$M$2,0)), \" \")","v":"Critical"},"Conventional Facilities  to design in an A-Frame lifting fixture rated for 1 ton to facilitate pump installation / removal ","Low","Unlikely",{"$f":"IFERROR(INDEX( 'Look-up Tables'!$I$3:$M$7, MATCH(L14,'Look-up Tables'!$H$3:$H$7,0), MATCH(M14,'Look-up Tables'!$I$2:$M$2,0)), \" \")","v":"Minor"},"Integrate into Design","Substitute","Implemented","Generic  Example"]
[null,null,null,null,null,null,null,null,null,{"$f":"IFERROR(INDEX( 'Look-up Tables'!$I$3:$M$7, MATCH(H15,'Look-up Tables'!$H$3:$H$7,0), MATCH(I15,'Look-up Tables'!$I$2:$M$2,0)), \" \")","v":" "},null,null,null,{"$f":"IFERROR(INDEX( 'Look-up Tables'!$I$3:$M$7, MATCH(L15,'Look-up Tables'!$H$3:$H$7,0), MATCH(M15,'Look-up Tables'!$I$2:$M$2,0)), \" \")","v":" "}]
[{"$f":"A14+1","v":5},"Environmental impact from antifreeze in cooling water system","Cybil Civil",null,"Disposal or Recycling","-","Cooling ponds and waters of the state","Low","Possible",{"$f":"IFERROR(INDEX( 'Look-up Tables'!$I$3:$M$7, MATCH(H16,'Look-up Tables'!$H$3:$H$7,0), MATCH(I16,'Look-up Tables'!$I$2:$M$2,0)), \" \")","v":"Moderate"},"Original version of technical specification called for use of propylene glycol as an antifreeze in cooling water system. Determined antifreeze in cooling water is unnecessary","Minimal","Unlikely",{"$f":"IFERROR(INDEX( 'Look-up Tables'!$I$3:$M$7, MATCH(L16,'Look-up Tables'!$H$3:$H$7,0), MATCH(M16,'Look-up Tables'!$I$2:$M$2,0)), \" \")","v":"Negligible"},"No Action Required","Substitute","No Action Required","Generic Example "]
[null,null,null,null,null,null,null,null,null,{"$f":"IFERROR(INDEX( 'Look-up Tables'!$I$3:$M$7, MATCH(H17,'Look-up Tables'!$H$3:$H$7,0), MATCH(I17,'Look-up Tables'!$I$2:$M$2,0)), \" \")","v":" "},null,null,null,{"$f":"IFERROR(INDEX( 'Look-up Tables'!$I$3:$M$7, MATCH(L17,'Look-up Tables'!$H$3:$H$7,0), MATCH(M17,'Look-up Tables'!$I$2:$M$2,0)), \" \")","v":" "}]
[{"$f":"A16+1","v":6},"People writing or reviewing the specifications may not have sufficient depth/breadth of subject matter expertise ","Lea D. Engineer",null,"Specification","Anybody near the equipment being designed","The equipment being designed","High","Likely",{"$f":"IFERROR(INDEX( 'Look-up Tables'!$I$3:$M$7, MATCH(H18,'Look-up Tables'!$H$3:$H$7,0), MATCH(I18,'Look-up Tables'!$I$2:$M$2,0)), \" \")","v":"Critical"},"Assign qualified subject matter expert(s) at the very beginning of the engineering process","High","Unlikely",{"$f":"IFERROR(INDEX( 'Look-up Tables'!$I$3:$M$7, MATCH(L18,'Look-up Tables'!$H$3:$H$7,0), MATCH(M18,'Look-up Tables'!$I$2:$M$2,0)), \" \")","v":"Moderate"},"Int. into Specs and Interfaces","Admin. Controls","Not Yet Implemented","Generic Example"]
[null,null,null,null,null,null,null,null,null,{"$f":"IFERROR(INDEX( 'Look-up Tables'!$I$3:$M$7, MATCH(H19,'Look-up Tables'!$H$3:$H$7,0), MATCH(I19,'Look-up Tables'!$I$2:$M$2,0)), \" \")","v":" "},null,null,null,{"$f":"IFERROR(INDEX( 'Look-up Tables'!$I$3:$M$7, MATCH(L19,'Look-up Tables'!$H$3:$H$7,0), MATCH(M19,'Look-up Tables'!$I$2:$M$2,0)), \" \")","v":" "}]
[{"$f":"A18+1","v":7},"Vendor(s) may not be sufficiently capable of delivering a device per FNAL technical specifications","Lea D. Engineer",null,"Procurement",null,"Device performance, schedule & cost","High","Likely",{"$f":"IFERROR(INDEX( 'Look-up Tables'!$I$3:$M$7, MATCH(H20,'Look-up Tables'!$H$3:$H$7,0), MATCH(I20,'Look-up Tables'!$I$2:$M$2,0)), \" \")","v":"Critical"},"Supply technical questionairre as part of request for vendor bids.  Apply detailed technical evaluation to score each vendor on their technical capabilities.  Collect lessons learned on past procurements with similar projects.  Use technical evaluation to select vendor that provides highest value to Fermilab.","Low","Unlikely",{"$f":"IFERROR(INDEX( 'Look-up Tables'!$I$3:$M$7, MATCH(L20,'Look-up Tables'!$H$3:$H$7,0), MATCH(M20,'Look-up Tables'!$I$2:$M$2,0)), \" \")","v":"Minor"},"Int. into Specs and Interfaces","Admin. Controls","Implemented","Generic Example"]
{"$rows_left_out":185}
{"sheet":"Probability","index":2,"n_rows":9,"n_cols":3,"rows_kept":9,"cut":false,"hidden":false,"merged":[[8,2,8,3],[2,1,2,3],[3,2,3,3],[4,2,4,3],[5,2,5,3],[6,2,6,3],[7,2,7,3]]}
[null,null,"Fermilab QAM 12030TA Table 2"]
[]
[null,"MISHAP PROBABILITY TABLE"]
[null,"PROBABILITY","DESCRIPTION"]
[null,"Almost Certain","Could occur annually"]
[null,"Likely","Could occur once in two years"]
[null,"Possible","Occurring not more than once in ten years"]
[null,"Unlikely","Occurring not more than once in thirty years"]
[null,"Rare","Occurring not more than once in one hundred years."]

{"sheet":"Hazard Severity Matrix","index":3,"n_rows":10,"n_cols":7,"rows_kept":10,"cut":false,"hidden":false,"merged":[[2,1,2,6]]}
[null,null,null,null,"Fermilab QAM 12030TA Table 1"]
[]
[null,"HAZARD SEVERITY"]
[null,"SEVERITY","PEOPLE","ENVIRONMENT","COMPLIANCE","PROPERTY","PROCESS/PROJECT"]
[null,"CRITICAL","Multiple deaths from injury or illness; multiple cases of injuries involving permanent disability; or chronic irreversible illnesses.","Permanent loss of a public resource (e.g. drinking water, air, stream, or river).","Willful disregard for the rules and regulations.","Loss of multiple facilities or program components; (>$5,000,000 total cost*)","Total breakdown identified resulting in loss/shut down of a process or project."]
[null,"HIGH","One death from injury or illness; one case of injury involving permanent disability; or chronic irreversible illnesses.","Long-term loss of a public resource (e.g., drinking water, air, stream, or river).","Major noncompliance that exposes the Lab to significant potential fines and penalties.","Loss of a facility or critical program component; (>$5,000,000 total cost*)","Major breakdown identified resulting in the failure to attain the budget, schedule, key performance indicators or customer expectations."]
[null,"MEDIUM","Injuries or temporary, reversible illnesses resulting in hospitalization of a variable but limited period of disability.","Seriously impair the functioning of a public resource.","Significant noncompliance that requires reporting to DOE or other authorities.","Major property damage or critical program component; \n($1,000,000 - $5,000,000 total cost*)","Significant compromise to the attainment of the budget, schedule, key performance indicators or customer expectations which exposes process/project to potential failure if gap cannot be immediately resolved."]
[null,"LOW","Injuries or temporary, reversible illnesses not resulting in hospitalization with lost time.","Isolated and minor, but measurable, impact(s) on some component(s) of a public resource.","Programmatic noncompliance with the Lab's Work Smart set.","Minor property damage or critical program component; \n($50,000 - $1,000,000 total cost*)","Minor breakdown or gap identified which does not result in significant compromise to the attainment of the budget, schedule, key performance indicators or customer expectations; gaps can be resolved."]
[null,"MINIMAL","Injuries or temporary illnesses requiring only minor supportive treatment and no lost time.","No measurable impact on component(s) of a public resource","Specific instance of a noncompliance with the Lab's Work Smart set.","Standard property damage or critical program component; (<$50,000 total cost*)","Minor gaps identified which do not compromise the attainment of the budget, schedule, key performance indicators or customer expectations; gaps can easily be resolved. "]
[null,null,null,null,null,"* total cost = total dollar value including parts, labor, contingency plans, etc. that is necessary to repair/replace property or program component."]

{"sheet":"Risk Assessment Actions","index":4,"n_rows":16,"n_cols":19,"rows_kept":16,"cut":false,"hidden":false,"merged":[[6,2,6,4],[1,1,1,4],[2,2,2,4],[3,2,3,4],[4,2,4,4],[5,2,5,4]]}
[]
[null,"Risk Assessment Codes and Actions"]
[null,"Very High","Unacceptable. Operation not permissible.  Immediate action necessary."]
[null,"High","Mitagation action(s) to be given a high priority."]
[null,"Moderate","Mitagation action(s) to be taken at an appropriate time. Can be considered an acceptable risk."]
[null,"Low","Mitagation action(s) discretionary. "]
[null,"Negligible","No action necessary."]
[]
[]
[]
[]
[]
[]
[]
[]
[null,null,null,null,null,null,null,null,null,null,null,null,null,null,null,null,null,null,";"]

{"sheet":"Hazard Control Hierarchy","index":5,"n_rows":0,"n_cols":0,"rows_kept":0,"cut":false,"hidden":false,"merged":[]}

{"sheet":"Look-up Tables","index":6,"n_rows":19,"n_cols":19,"rows_kept":19,"cut":false,"hidden":false,"merged":[]}
["Life Cycle Stage","Risk Owner(s)","Subsystem",null,"Severity","Probability",null,null,null,"Risk Matrix",null,null,null,null,"Mitigation Action","Implementation Effectiveness","Status of Implementation",null,"Review Phase"]
[null,null,null,null,null,null,null,null,"Almost Certain","Likely","Possible","Unlikely","Rare"]
["Specification","MagPS","BTL-Magnets",null,"Critical","Almost Certain",null,"Critical","Critical","Critical","Critical","Serious","Moderate",null,"Int. into Design","Eliminate","Implemented",null,"Requirements & Specifications"]
["Design","Connie Controls","BTL-Power Supplies",null,"High","Likely",null,"High","Critical","Critical","Serious","Moderate","Minor",null,"Int. into QA Plan","Substitute","In Process",null,"Conceptual Design"]
["Procurement","Ellie Electrical","Subsystem 3",null,"Medium","Possible",null,"Medium","Critical","Serious","Moderate","Moderate","Minor",null,"Int. into Specs and Interfaces","Engr. Controls","Not Yet Implemented",null,"Preliminary Design"]
["Fabrication","Lea D. Engineer","Subsystem 4",null,"Low","Unlikely",null,"Low","Serious","Moderate","Moderate","Minor","Negligible",null,"Int. into Admin Proc. and PPE","Admin. Controls","No Action Required",null,"Final Design"]
["Inspection","Mikayla Mechanical","Subsystem 5",null,"Minimal","Rare",null,"Minimal","Moderate","Minor","Minor","Negligible","Negligible",null,"No Action Required","PPE","Canceled",null,"Manufacturing Readiness"]
["Testing","Stella Structural",null,null,null,null,null,null,null,null,null,null,null,null,null,null,null,null,"Procurement Readiness"]
["Shipping",null,null,null,null,null,null,null,null,null,null,null,null,null,null,null,null,null,"System Acceptance"]
["Installation",null,null,null,null,null,null,null,null,null,null,null,null,null,null,null,null,null,"Transportation Readiness"]
["Commissioning",null,null,null,null,null,null,null,null,null,null,null,null,null,null,null,null,null,"Installation Readiness"]
["Operations",null,null,null,null,null,null,null,null,null,null,null,null,null,null,null,null,null,"Operational Readiness"]
["Equipment Shutdown"]
["Maintenance"]
["Troubleshooting"]
["Repairs/Replacement"]
["Decommissioning"]
["Disposal or Recycling"]
["Multiple"]